Target
Delta-type opioid receptor
Ligand
BDBM50213379
Substrate
Meas. Tech.
ChEMBL_447456 (CHEMBL896479)
Ki
37±n/a nM
Citation
 Trabanco, AAAerts, NAlvarez, RMAndrés, JIBoeckx, IFernández, JGómez, AJanssens, FELeenaerts, JEDe Lucas, AIMatesanz, ESteckler, TPullan, S 4-Phenyl-4-[1H-imidazol-2-yl]-piperidine derivatives as non-peptidic selective delta-opioid agonists with potential anxiolytic/antidepressant properties. Part 2. Bioorg Med Chem Lett 17:3860-3 (2007)  
Target
Name:
Delta-type opioid receptor
Synonyms:
D-OR-1 Delta opioid receptor OPIATE Delta OPRD1 OPRK1 | opioid receptor, delta 1
Type:
G Protein-Coupled Receptor (GPCR)
Mol. Mass.:
40382.98
Organism:
Homo sapiens (Human)
Description:
Competition binding assays were carried out using membrane preparations from transfected HN9.10 cells that constitutively expressed the delta opioid receptor.
Residue:
372
  
Inhibitor
Name:
BDBM50213379
Synonyms:
1-(4-(1-benzyl-1H-imidazol-2-yl)-4-phenylpiperidin-1-yl)ethanone | CHEMBL232383
Type:
Small organic molecule
Emp. Form.:
C23H25N3O
Mol. Mass.:
359.4641
SMILES:
CC(=O)N1CCC(CC1)(c1nccn1Cc1ccccc1)c1ccccc1
: