Target
Vascular endothelial growth factor receptor 2
Ligand
BDBM50214117
Substrate
Meas. Tech.
ChEMBL_456266 (CHEMBL888276)
IC50
>100±n/a nM
Citation
 Lin, RConnolly, PJLu, YChiu, GLi, SYu, YHuang, SLi, XEmanuel, SLMiddleton, SAGruninger, RHAdams, MFuentes-Pesquera, ARGreenberger, LM Synthesis and evaluation of pyrazolo[3,4-b]pyridine CDK1 inhibitors as anti-tumor agents. Bioorg Med Chem Lett 17:4297-302 (2007)  
Target
Name:
Vascular endothelial growth factor receptor 2
Synonyms:
CD_antigen=CD309 Fetal liver kinase 1 (FLK-1) KDR Protein-tyrosine kinase receptor Flk-1 VEGFR-2 VEGFR2 Vascular Endothelial Growth Factor Receptor Kinase 2 Vascular endothelial growth factor receptor 2 (KDR) Vascular endothelial growth factor receptor 2 (VEGFR2) Vascular endothelial growth factor receptor-2 (VEGFR-2)
Type:
Receptor Tyrosine Kinase
Mol. Mass.:
151510.97
Organism:
Homo sapiens (Human)
Description:
P35968
Residue:
1356
  
Inhibitor
Name:
BDBM50214117
Synonyms:
CHEMBL400906 | N-methyl(5-(3-(5-(trifluoromethoxy)-1H-benzo[d]imidazol-2-yl)-1H-pyrazolo[3,4-b]pyridin-5-yl)pyridin-3-yl)methanamine
Type:
Small organic molecule
Emp. Form.:
C21H16F3N7O
Mol. Mass.:
439.3932
SMILES:
CNCc1cncc(c1)-c1cnc2[nH]nc(-c3nc4ccc(OC(F)(F)F)cc4[nH]3)c2c1
: