Target
Cyclin-dependent kinase 1
Ligand
BDBM50214113
Substrate
Meas. Tech.
ChEMBL_456265 (CHEMBL888275)
IC50
53±n/a nM
Citation
 Lin, RConnolly, PJLu, YChiu, GLi, SYu, YHuang, SLi, XEmanuel, SLMiddleton, SAGruninger, RHAdams, MFuentes-Pesquera, ARGreenberger, LM Synthesis and evaluation of pyrazolo[3,4-b]pyridine CDK1 inhibitors as anti-tumor agents. Bioorg Med Chem Lett 17:4297-302 (2007)  
Target
Name:
Cyclin-dependent kinase 1
Synonyms:
CDC2 CDK1 CDKN1 Cell division protein kinase 1 P34CDC2 | p34 protein kinase
Type:
Enzyme Subunit
Mol. Mass.:
34101.08
Organism:
Homo sapiens (Human)
Description:
P06493
Residue:
297
  
Inhibitor
Name:
BDBM50214113
Synonyms:
CHEMBL251739 | N,N-diethyl-2-(5-(isoquinolin-4-yl)-1H-pyrazolo[3,4-b]pyridin-3-yl)-1H-benzo[d]imidazole-4-carboxamide
Type:
Small organic molecule
Emp. Form.:
C27H23N7O
Mol. Mass.:
461.5178
SMILES:
CCN(CC)C(=O)c1cccc2[nH]c(nc12)-c1n[nH]c2ncc(cc12)-c1cncc2ccccc12
: