Target
Histone deacetylase 1
Ligand
BDBM50099857
Substrate
Meas. Tech.
ChEMBL_456402 (CHEMBL907491)
IC50
625000±n/a nM
Citation
 Siliphaivanh, PHarrington, PWitter, DJOtte, KTempest, PKattar, SKral, AMFleming, JCDeshmukh, SVHarsch, ASecrist, PJMiller, TA Design of novel histone deacetylase inhibitors. Bioorg Med Chem Lett 17:4619-24 (2007)  
Target
Name:
Histone deacetylase 1
Synonyms:
Cereblon/Histone deacetylase 1 HDAC1 Histone deacetylase 1 (HDAC1) RPD3L1
Type:
Enzyme
Mol. Mass.:
55090.27
Organism:
Homo sapiens (Human)
Description:
Q13547
Residue:
482
  
Inhibitor
Name:
BDBM50099857
Synonyms:
ACETOHYDROXAMIC ACID (AHA) Acethydroxamsaeure Acetic acid, oxime Cetohyroxamic acid Methylhydroxamic acid N-Acetylhydroxylamine acetohydroxamic acid
Type:
Small organic molecule
Emp. Form.:
C2H5NO2
Mol. Mass.:
75.0666
SMILES:
CC(=O)NO
: