Target
Histone deacetylase 1
Ligand
BDBM50099857
Substrate
Meas. Tech.
ChEMBL_456584 (CHEMBL923961)
IC50
625000±n/a nM
Citation
 Witter, DJBelvedere, SChen, LSecrist, JPMosley, RTMiller, TA Benzo[b]thiophene-based histone deacetylase inhibitors. Bioorg Med Chem Lett 17:4562-7 (2007)  
Target
Name:
Histone deacetylase 1
Synonyms:
Cereblon/Histone deacetylase 1 HDAC1 Histone deacetylase 1 (HDAC1) RPD3L1
Type:
Enzyme
Mol. Mass.:
55090.27
Organism:
Homo sapiens (Human)
Description:
Q13547
Residue:
482
  
Inhibitor
Name:
BDBM50099857
Synonyms:
ACETOHYDROXAMIC ACID (AHA) Acethydroxamsaeure Acetic acid, oxime Cetohyroxamic acid Methylhydroxamic acid N-Acetylhydroxylamine acetohydroxamic acid
Type:
Small organic molecule
Emp. Form.:
C2H5NO2
Mol. Mass.:
75.0666
SMILES:
CC(=O)NO
: