Target
D(1B) dopamine receptor
Ligand
BDBM50216044
Substrate
Meas. Tech.
ChEMBL_448361 (CHEMBL898622)
Ki
80.8±n/a nM
Citation
 Awadallah, FMMüller, FLehmann, JAbadi, AH Synthesis of novel lactam derivatives and their evaluation as ligands for the dopamine receptors, leading to a D(4)-selective ligand. Bioorg Med Chem 15:5811-8 (2007)  
Target
Name:
D(1B) dopamine receptor
Synonyms:
D(5) dopamine receptor DOPAMINE D5 DRD1L2 DRD5_HUMAN | dopamine receptor D5
Type:
Protein
Mol. Mass.:
52943.41
Organism:
Homo sapiens (Human)
Description:
P21918
Residue:
477
  
Inhibitor
Name:
BDBM50216044
Synonyms:
2-(4-(4-(3-a,a,a-trifluorotolyl)-1-piperazinyl)butyl)-1-isoindolinone | CHEMBL240996
Type:
Small organic molecule
Emp. Form.:
C23H26F3N3O
Mol. Mass.:
417.4672
SMILES:
FC(F)(F)c1cccc(c1)N1CCN(CCCCN2Cc3ccccc3C2=O)CC1
: