Target
D(1B) dopamine receptor
Ligand
BDBM50216047
Substrate
Meas. Tech.
ChEMBL_448361 (CHEMBL898622)
Ki
75.4±n/a nM
Citation
 Awadallah, FMMüller, FLehmann, JAbadi, AH Synthesis of novel lactam derivatives and their evaluation as ligands for the dopamine receptors, leading to a D(4)-selective ligand. Bioorg Med Chem 15:5811-8 (2007)  
Target
Name:
D(1B) dopamine receptor
Synonyms:
D(5) dopamine receptor DOPAMINE D5 DRD1L2 DRD5_HUMAN | dopamine receptor D5
Type:
Protein
Mol. Mass.:
52943.41
Organism:
Homo sapiens (Human)
Description:
P21918
Residue:
477
  
Inhibitor
Name:
BDBM50216047
Synonyms:
2-(4-(4-phenyl-1-piperazinyl)butyl)-1-isoindolinone CHEMBL393492
Type:
Small organic molecule
Emp. Form.:
C23H29N3O2
Mol. Mass.:
379.4953
SMILES:
COc1ccccc1N1CCN(CCCCN2Cc3ccccc3C2=O)CC1
: