Target
D(2) dopamine receptor
Ligand
BDBM50216047
Substrate
Meas. Tech.
ChEMBL_448363 (CHEMBL898624)
Ki
34±n/a nM
Citation
 Awadallah, FMMüller, FLehmann, JAbadi, AH Synthesis of novel lactam derivatives and their evaluation as ligands for the dopamine receptors, leading to a D(4)-selective ligand. Bioorg Med Chem 15:5811-8 (2007)  
Target
Name:
D(2) dopamine receptor
Synonyms:
D(2) dopamine receptor DOPAMINE D2 Long DRD2 Dopamine D2 receptor Dopamine D2 receptor (D2R) Dopamine2-like | d2
Type:
Cell-surface receptors
Mol. Mass.:
50647.10
Organism:
Homo sapiens (Human)
Description:
P14416
Residue:
443
  
Inhibitor
Name:
BDBM50216047
Synonyms:
2-(4-(4-phenyl-1-piperazinyl)butyl)-1-isoindolinone CHEMBL393492
Type:
Small organic molecule
Emp. Form.:
C23H29N3O2
Mol. Mass.:
379.4953
SMILES:
COc1ccccc1N1CCN(CCCCN2Cc3ccccc3C2=O)CC1
: