Target
D(2) dopamine receptor
Ligand
BDBM50216040
Substrate
Meas. Tech.
ChEMBL_448363 (CHEMBL898624)
Ki
1.2±n/a nM
Citation
 Awadallah, FMMüller, FLehmann, JAbadi, AH Synthesis of novel lactam derivatives and their evaluation as ligands for the dopamine receptors, leading to a D(4)-selective ligand. Bioorg Med Chem 15:5811-8 (2007)  
Target
Name:
D(2) dopamine receptor
Synonyms:
D(2) dopamine receptor DOPAMINE D2 Long DRD2 Dopamine D2 receptor Dopamine D2 receptor (D2R) Dopamine2-like | d2
Type:
Cell-surface receptors
Mol. Mass.:
50647.10
Organism:
Homo sapiens (Human)
Description:
P14416
Residue:
443
  
Inhibitor
Name:
BDBM50216040
Synonyms:
3-(4-(4-(2-methoxyphenyl)piperazin-1-yl)butyl)quinazolin-4(3H)-one CHEMBL239700
Type:
Small organic molecule
Emp. Form.:
C23H28N4O2
Mol. Mass.:
392.494
SMILES:
COc1ccccc1N1CCN(CCCCn2cnc3ccccc3c2=O)CC1
: