Target
D(3) dopamine receptor
Ligand
BDBM50216039
Substrate
Meas. Tech.
ChEMBL_448359 (CHEMBL898620)
Ki
80±n/a nM
Citation
 Awadallah, FMMüller, FLehmann, JAbadi, AH Synthesis of novel lactam derivatives and their evaluation as ligands for the dopamine receptors, leading to a D(4)-selective ligand. Bioorg Med Chem 15:5811-8 (2007)  
Target
Name:
D(3) dopamine receptor
Synonyms:
DOPAMINE D3 DRD3_HUMAN Dopamine D3 receptor (D3) Dopamine receptor Dopamine receptor D3
Type:
Mol. Mass.:
44243.43
Organism:
Homo sapiens (Human)
Description:
Residue:
400
  
Inhibitor
Name:
BDBM50216039
Synonyms:
1-(4-(4-(2-methoxyphenyl)-1-piperazinyl)butyl)-indolin-2-one CHEMBL395933
Type:
Small organic molecule
Emp. Form.:
C22H27N3O
Mol. Mass.:
349.4693
SMILES:
O=C1Cc2ccccc2N1CCCCN1CCN(CC1)c1ccccc1
: