Target
D(2) dopamine receptor
Ligand
BDBM50216041
Substrate
Meas. Tech.
ChEMBL_448358 (CHEMBL898619)
Ki
46±n/a nM
Citation
 Awadallah, FMMüller, FLehmann, JAbadi, AH Synthesis of novel lactam derivatives and their evaluation as ligands for the dopamine receptors, leading to a D(4)-selective ligand. Bioorg Med Chem 15:5811-8 (2007)  
Target
Name:
D(2) dopamine receptor
Synonyms:
D(2) dopamine receptor DOPAMINE D2 Long DRD2 Dopamine D2 receptor Dopamine D2 receptor (D2R) Dopamine2-like | d2
Type:
Cell-surface receptors
Mol. Mass.:
50647.10
Organism:
Homo sapiens (Human)
Description:
P14416
Residue:
443
  
Inhibitor
Name:
BDBM50216041
Synonyms:
3-(4-(4-(2-methoxyphenyl)-1-piperazinyl)butyl)quinazolin-4(3H)-one | CHEMBL238717
Type:
Small organic molecule
Emp. Form.:
C22H26N4O
Mol. Mass.:
362.468
SMILES:
O=c1n(CCCCN2CCN(CC2)c2ccccc2)cnc2ccccc12
: