Target
D(2) dopamine receptor
Ligand
BDBM50216039
Substrate
Meas. Tech.
ChEMBL_448363 (CHEMBL898624)
Ki
153±n/a nM
Citation
 Awadallah, FMMüller, FLehmann, JAbadi, AH Synthesis of novel lactam derivatives and their evaluation as ligands for the dopamine receptors, leading to a D(4)-selective ligand. Bioorg Med Chem 15:5811-8 (2007)  
Target
Name:
D(2) dopamine receptor
Synonyms:
D(2) dopamine receptor DOPAMINE D2 Long DRD2 Dopamine D2 receptor Dopamine D2 receptor (D2R) Dopamine2-like | d2
Type:
Cell-surface receptors
Mol. Mass.:
50647.10
Organism:
Homo sapiens (Human)
Description:
P14416
Residue:
443
  
Inhibitor
Name:
BDBM50216039
Synonyms:
1-(4-(4-(2-methoxyphenyl)-1-piperazinyl)butyl)-indolin-2-one CHEMBL395933
Type:
Small organic molecule
Emp. Form.:
C22H27N3O
Mol. Mass.:
349.4693
SMILES:
O=C1Cc2ccccc2N1CCCCN1CCN(CC1)c1ccccc1
: