Target
Beta-secretase 1
Ligand
BDBM50216174
Substrate
Meas. Tech.
ChEMBL_439909 (CHEMBL890226)
IC50
910±n/a nM
Citation
 Stanton, MGStauffer, SRGregro, ARSteinbeiser, MNantermet, PSankaranarayanan, SPrice, EAWu, GCrouthamel, MCEllis, JLai, MTEspeseth, ASShi, XPJin, LColussi, DPietrak, BHuang, QXu, MSimon, AJGraham, SLVacca, JPSelnick, H Discovery of isonicotinamide derived beta-secretase inhibitors: in vivo reduction of beta-amyloid. J Med Chem 50:3431-3 (2007)  
Target
Name:
Beta-secretase 1
Synonyms:
ASP2 Aspartyl protease 2 BACE1 Beta-secretase (BACE) Beta-secretase 1 (BACE 1) Beta-secretase 1 (BACE1) Beta-site amyloid precursor protein cleaving enzyme 1 Memapsin-2 beta-Secretase (BACE-1) | beta-Secretase (BACE1)
Type:
Protein
Mol. Mass.:
55755.10
Organism:
Homo sapiens (Human)
Description:
P56817
Residue:
501
  
Inhibitor
Name:
BDBM50216174
Synonyms:
CHEMBL230355 | N-[(1S,2R)-2-amino-1-benzyl-3-fluoropropyl]-2-[(isopropylsulfonyl)(methyl)amino]-6-(methyl{[(1S,2S)-2-methylcyclopropyl]methyl}amino)isonicotinamide
Type:
Small organic molecule
Emp. Form.:
C26H36F3N5O3S
Mol. Mass.:
555.656
SMILES:
CC(C)S(=O)(=O)N(C)c1cc(cc(n1)N(C)C[C@H]1C[C@@H]1C)C(=O)N[C@@H](Cc1cc(F)cc(F)c1)[C@@H](N)CF
: