Target
Beta-secretase 1
Ligand
BDBM50216178
Substrate
Meas. Tech.
ChEMBL_439909 (CHEMBL890226)
IC50
>20000±n/a nM
Citation
 Stanton, MGStauffer, SRGregro, ARSteinbeiser, MNantermet, PSankaranarayanan, SPrice, EAWu, GCrouthamel, MCEllis, JLai, MTEspeseth, ASShi, XPJin, LColussi, DPietrak, BHuang, QXu, MSimon, AJGraham, SLVacca, JPSelnick, H Discovery of isonicotinamide derived beta-secretase inhibitors: in vivo reduction of beta-amyloid. J Med Chem 50:3431-3 (2007)  
Target
Name:
Beta-secretase 1
Synonyms:
ASP2 Aspartyl protease 2 BACE1 Beta-secretase (BACE) Beta-secretase 1 (BACE 1) Beta-secretase 1 (BACE1) Beta-site amyloid precursor protein cleaving enzyme 1 Memapsin-2 beta-Secretase (BACE-1) | beta-Secretase (BACE1)
Type:
Protein
Mol. Mass.:
55755.10
Organism:
Homo sapiens (Human)
Description:
P56817
Residue:
501
  
Inhibitor
Name:
BDBM50216178
Synonyms:
CHEMBL394850 | N-[(1S)-1-benzyl-2-hydroxyethyl]-2-[(cyclopropylmethyl)(propyl)amino]-6-[(isopropylsulfonyl)(methyl)amino]isonicotinamide
Type:
Small organic molecule
Emp. Form.:
C26H36F2N4O4S
Mol. Mass.:
538.65
SMILES:
CCCN(CC1CC1)c1cc(cc(n1)N(C)S(=O)(=O)C(C)C)C(=O)N[C@H](CO)Cc1cc(F)cc(F)c1
: