Target
Solute carrier family 2, facilitated glucose transporter member 1
Ligand
BDBM50216469
Substrate
Meas. Tech.
ChEMBL_456667 (CHEMBL924048)
Ki
400000±n/a nM
Citation
 Ionita, MKrishna, SLéo, PMMorin, CPatel, AP Interaction of O-(undec-10-en)-yl-D-glucose derivatives with the Plasmodium falciparum hexose transporter (PfHT). Bioorg Med Chem Lett 17:4934-7 (2007)  
Target
Name:
Solute carrier family 2, facilitated glucose transporter member 1
Synonyms:
GLUT-1 GTR1_HUMAN Glucose transporter HepG2 glucose transporter | SLC2A1
Type:
Protein
Mol. Mass.:
54091.71
Organism:
Homo sapiens (Human)
Description:
Residue:
492
  
Inhibitor
Name:
BDBM50216469
Synonyms:
(3R,4S,5S,6R)-6-((undec-10-enyloxy)methyl)-tetrahydro-2H-pyran-2,3,4,5-tetraol | CHEMBL249476
Type:
Small organic molecule
Emp. Form.:
C17H32O6
Mol. Mass.:
332.4324
SMILES:
OC1O[C@H](COCCCCCCCCCC=C)[C@@H](O)[C@H](O)[C@H]1O
: