Target
Sodium channel protein type 9 subunit alpha
Ligand
BDBM50216659
Substrate
Meas. Tech.
ChEMBL_456687 (CHEMBL924068)
IC50
23±n/a nM
Citation
 Hoyt, SBLondon, CGorin, DWyvratt, MJFisher, MHAbbadie, CFelix, JPGarcia, MLLi, XLyons, KAMcGowan, EMacIntyre, DEMartin, WJPriest, BTRitter, ASmith, MMWarren, VAWilliams, BSKaczorowski, GJParsons, WH Discovery of a novel class of benzazepinone Na(v)1.7 blockers: potential treatments for neuropathic pain. Bioorg Med Chem Lett 17:4630-4 (2007)  
Target
Name:
Sodium channel protein type 9 subunit alpha
Synonyms:
NENA Peripheral sodium channel 1 SCN9A_HUMAN Voltage-gated sodium channel subunit Nav1.7 hNE-Na
Type:
Protein
Mol. Mass.:
226375.97
Organism:
Homo sapiens (Human)
Description:
Q15858
Residue:
1988
  
Inhibitor
Name:
BDBM50216659
Synonyms:
CHEMBL248195 | tert-butyl (R)-3-(2,5-difluorophenyl)-1-((R)-1-isopropyl-2-oxo-2,3,4,5-tetrahydro-1H-benzo[b]azepin-3-ylamino)-1-oxopropan-2-ylcarbamate
Type:
Small organic molecule
Emp. Form.:
C27H33F2N3O4
Mol. Mass.:
501.5654
SMILES:
CC(C)N1c2ccccc2CC[C@@H](NC(=O)[C@@H](Cc2cc(F)ccc2F)NC(=O)OC(C)(C)C)C1=O
: