Target
Deoxyhypusine synthase
Ligand
BDBM50216786
Substrate
Meas. Tech.
ChEMBL_437263 (CHEMBL906657)
Ki
100±n/a nM
Citation
 Kaiser, AHammels, IGottwald, ANassar, MZaghloul, MSMotaal, BAHauber, JHoerauf, A Modification of eukaryotic initiation factor 5A from Plasmodium vivax by a truncated deoxyhypusine synthase from Plasmodium falciparum: An enzyme with dual enzymatic properties. Bioorg Med Chem 15:6200-7 (2007)  
Target
Name:
Deoxyhypusine synthase
Synonyms:
Type:
PROTEIN
Mol. Mass.:
57187.86
Organism:
Plasmodium falciparum
Description:
ChEMBL_437263
Residue:
496
  
Inhibitor
Name:
BDBM50216786
Synonyms:
CHEMBL229457 N-guanyl-1,7-diaminoheptane
Type:
Small organic molecule
Emp. Form.:
C8H20N4
Mol. Mass.:
172.2712
SMILES:
[#7]-[#6]-[#6]-[#6]-[#6]-[#6]-[#6]-[#6]\[#7]=[#6](/[#7])-[#7]
: