Target
Beta-1 adrenergic receptor
Ligand
BDBM50218167
Substrate
Meas. Tech.
ChEMBL_457030 (CHEMBL924394)
Ki
360±n/a nM
Citation
 Lafontaine, JADay, RFDibrino, JHadcock, JRHargrove, DMLinhares, MMartin, KAMaurer, TSNardone, NATess, DADasilva-Jardine, P Discovery of potent and orally bioavailable heterocycle-based beta3-adrenergic receptor agonists, potential therapeutics for the treatment of obesity. Bioorg Med Chem Lett 17:5245-50 (2007)  
Target
Name:
Beta-1 adrenergic receptor
Synonyms:
ADRB1 ADRB1_HUMAN Beta-1 adrenoceptor | adrenergic Beta1
Type:
G Protein-Coupled Receptor (GPCR)
Mol. Mass.:
51338.40
Organism:
Homo sapiens (Human)
Description:
P08588
Residue:
477
  
Inhibitor
Name:
BDBM50218167
Synonyms:
(R)-2-(2-(4-(2-isopropyloxazol-4-yl)phenoxy)ethylamino)-1-(pyridin-3-yl)ethanol | CHEMBL250352
Type:
Small organic molecule
Emp. Form.:
C21H25N3O3
Mol. Mass.:
367.4415
SMILES:
CC(C)c1nc(co1)-c1ccc(OCCNC[C@H](O)c2cccnc2)cc1
: