Target
Serine/threonine-protein kinase Chk1
Ligand
BDBM50218718
Substrate
Meas. Tech.
ChEMBL_444965 (CHEMBL894121)
IC50
910±n/a nM
Citation
 Wang, LSullivan, GMHexamer, LAHasvold, LAThalji, RPrzytulinska, MTao, ZFLi, GChen, ZXiao, ZGu, WZXue, JBui, MHMerta, PKovar, PBouska, JJZhang, HPark, CStewart, KDSham, HLSowin, TJRosenberg, SHLin, NH Design, synthesis, and biological activity of 5,10-dihydro-dibenzo[b,e][1,4]diazepin-11-one-based potent and selective Chk-1 inhibitors. J Med Chem 50:4162-76 (2007)  
Target
Name:
Serine/threonine-protein kinase Chk1
Synonyms:
CHEK1 CHK1 checkpoint homolog Checkpoint kinase-1 (CHK1)
Type:
Enzyme Catalytic Domain
Mol. Mass.:
54443.02
Organism:
Homo sapiens (Human)
Description:
gi_166295192
Residue:
476
  
Inhibitor
Name:
BDBM50218718
Synonyms:
CHEMBL388435 | methyl 2-(3-(3-Methoxy-4-nitrophenyl)-11-oxo-10,11-dihydrodibenzo[b,f][1,4]oxazepin-8-yl)acetate
Type:
Small organic molecule
Emp. Form.:
C23H20N2O5
Mol. Mass.:
404.4153
SMILES:
COC(=O)Cc1ccc2Oc3cc(ccc3C(=O)Nc2c1)-c1ccc(N)c(OC)c1
: