Target
Serine/threonine-protein kinase Chk1
Ligand
BDBM50218704
Substrate
Meas. Tech.
ChEMBL_444965 (CHEMBL894121)
IC50
4±n/a nM
Citation
 Wang, LSullivan, GMHexamer, LAHasvold, LAThalji, RPrzytulinska, MTao, ZFLi, GChen, ZXiao, ZGu, WZXue, JBui, MHMerta, PKovar, PBouska, JJZhang, HPark, CStewart, KDSham, HLSowin, TJRosenberg, SHLin, NH Design, synthesis, and biological activity of 5,10-dihydro-dibenzo[b,e][1,4]diazepin-11-one-based potent and selective Chk-1 inhibitors. J Med Chem 50:4162-76 (2007)  
Target
Name:
Serine/threonine-protein kinase Chk1
Synonyms:
CHEK1 CHK1 checkpoint homolog Checkpoint kinase-1 (CHK1)
Type:
Enzyme Catalytic Domain
Mol. Mass.:
54443.02
Organism:
Homo sapiens (Human)
Description:
gi_166295192
Residue:
476
  
Inhibitor
Name:
BDBM50218704
Synonyms:
3-(4-amino-3-methoxy-phenyl)-7-morpholin-4-yl-5,10-dihydro-dibenzo[b,e][1,4]diazepin-11-one | CHEMBL243721
Type:
Small organic molecule
Emp. Form.:
C24H24N4O3
Mol. Mass.:
416.4724
SMILES:
COc1cc(ccc1N)-c1ccc2c(Nc3cc(ccc3NC2=O)N2CCOCC2)c1
: