Target
Serine/threonine-protein kinase Chk1
Ligand
BDBM50218735
Substrate
Meas. Tech.
ChEMBL_444965 (CHEMBL894121)
IC50
500±n/a nM
Citation
 Wang, LSullivan, GMHexamer, LAHasvold, LAThalji, RPrzytulinska, MTao, ZFLi, GChen, ZXiao, ZGu, WZXue, JBui, MHMerta, PKovar, PBouska, JJZhang, HPark, CStewart, KDSham, HLSowin, TJRosenberg, SHLin, NH Design, synthesis, and biological activity of 5,10-dihydro-dibenzo[b,e][1,4]diazepin-11-one-based potent and selective Chk-1 inhibitors. J Med Chem 50:4162-76 (2007)  
Target
Name:
Serine/threonine-protein kinase Chk1
Synonyms:
CHEK1 CHK1 checkpoint homolog Checkpoint kinase-1 (CHK1)
Type:
Enzyme Catalytic Domain
Mol. Mass.:
54443.02
Organism:
Homo sapiens (Human)
Description:
gi_166295192
Residue:
476
  
Inhibitor
Name:
BDBM50218735
Synonyms:
3-(3-methoxy-phenyl)-5,10-dihydro-dibenzo[b,e][1,4]diazepin-11-one | CHEMBL389551
Type:
Small organic molecule
Emp. Form.:
C20H16N2O2
Mol. Mass.:
316.3532
SMILES:
COc1cccc(c1)-c1ccc2c(Nc3ccccc3NC2=O)c1
: