Target
Macrophage colony-stimulating factor 1 receptor
Ligand
BDBM50218709
Substrate
Meas. Tech.
ChEMBL_445015 (CHEMBL894169)
IC50
>10000±n/a nM
Citation
 Wang, LSullivan, GMHexamer, LAHasvold, LAThalji, RPrzytulinska, MTao, ZFLi, GChen, ZXiao, ZGu, WZXue, JBui, MHMerta, PKovar, PBouska, JJZhang, HPark, CStewart, KDSham, HLSowin, TJRosenberg, SHLin, NH Design, synthesis, and biological activity of 5,10-dihydro-dibenzo[b,e][1,4]diazepin-11-one-based potent and selective Chk-1 inhibitors. J Med Chem 50:4162-76 (2007)  
Target
Name:
Macrophage colony-stimulating factor 1 receptor
Synonyms:
CSF1R FMS Macrophage colony stimulating factor receptor Macrophage colony-stimulating factor 1 receptor (c-FMS) Proto-oncogene c-Fms c-fms | cFMS
Type:
Protein
Mol. Mass.:
107979.48
Organism:
Homo sapiens (Human)
Description:
P07333
Residue:
972
  
Inhibitor
Name:
BDBM50218709
Synonyms:
2-[3-(3-methoxy-4-nitrophenyl)-11-oxo-10,11-dihydro-5Hdibenzo[b,e][1,4]diazepin-8-yl]-2-methyl-N-(4-morpholin-4-ylphenyl)propanamide | CHEMBL389745
Type:
Small organic molecule
Emp. Form.:
C34H35N5O4
Mol. Mass.:
577.6728
SMILES:
COc1cc(ccc1N)-c1ccc2c(Nc3ccc(cc3NC2=O)C(C)(C)C(=O)Nc2ccc(cc2)N2CCOCC2)c1
: