Target
RAC-alpha serine/threonine-protein kinase
Ligand
BDBM50218700
Substrate
Meas. Tech.
ChEMBL_445000 (CHEMBL894158)
IC50
880±n/a nM
Citation
 Wang, LSullivan, GMHexamer, LAHasvold, LAThalji, RPrzytulinska, MTao, ZFLi, GChen, ZXiao, ZGu, WZXue, JBui, MHMerta, PKovar, PBouska, JJZhang, HPark, CStewart, KDSham, HLSowin, TJRosenberg, SHLin, NH Design, synthesis, and biological activity of 5,10-dihydro-dibenzo[b,e][1,4]diazepin-11-one-based potent and selective Chk-1 inhibitors. J Med Chem 50:4162-76 (2007)  
Target
Name:
RAC-alpha serine/threonine-protein kinase
Synonyms:
AKT phosphorylation (p-AKT) AKT1/PPP1CA C-AKT PKB alpha Protein kinase B Protein kinase B (Akt 1) Protein kinase B alpha Proto-oncogene Akt (Akt1) Proto-oncogene c-Akt (AKT1) RAC-PK-alpha RAC-alpha serine/threonine-protein kinase (AKT1) | RAC-alpha serine/threonine-protein kinase (pAKT)
Type:
Enzyme
Mol. Mass.:
55681.25
Organism:
Homo sapiens (Human)
Description:
P31749
Residue:
480
  
Inhibitor
Name:
BDBM50218700
Synonyms:
2-[3-(3-methoxy-4-nitrophenyl)-11-oxo-10,11-dihydro-5Hdibenzo[b,e][1,4]diazepin-8-yl]-N-[4-(4-morpholinyl)phenyl]acetamide | CHEMBL395080
Type:
Small organic molecule
Emp. Form.:
C32H31N5O4
Mol. Mass.:
549.6196
SMILES:
COc1cc(ccc1N)-c1ccc2c(Nc3ccc(CC(=O)Nc4ccc(cc4)N4CCOCC4)cc3NC2=O)c1
: