Target
5-hydroxytryptamine receptor 1A
Ligand
BDBM50219108
Substrate
Meas. Tech.
ChEMBL_445365 (CHEMBL895655)
Ki
60.6±n/a nM
Citation
 Grundt, PPrevatt, KMCao, JTaylor, MFloresca, CZChoi, JKJenkins, BGLuedtke, RRNewman, AH Heterocyclic analogues of N-(4-(4-(2,3-dichlorophenyl)piperazin-1-yl)butyl)arylcarboxamides with functionalized linking chains as novel dopamine D3 receptor ligands: potential substance abuse therapeutic agents. J Med Chem 50:4135-46 (2007)  
Target
Name:
5-hydroxytryptamine receptor 1A
Synonyms:
5-HT-1A 5-hydroxytryptamine receptor 1A (5-HT-1A) ADRB2RL1 Dopamine D2 receptor and serotonin 1a receptor HTR1A | Serotonin receptor 1A
Type:
Mol. Mass.:
46122.49
Organism:
Homo sapiens (Human)
Description:
Residue:
422
  
Inhibitor
Name:
BDBM50219108
Synonyms:
CHEMBL244774 | N-(4-(4-(2,3-dichlorophenyl)piperazin-1-yl)-trans-but-2-enyl)-4-(pyridin-N-oxide-2-yl)benzamide
Type:
Small organic molecule
Emp. Form.:
C26H26Cl2N4O2
Mol. Mass.:
497.416
SMILES:
[O-][n+]1ccccc1-c1ccc(cc1)C(=O)NC\C=C\CN1CCN(CC1)c1cccc(Cl)c1Cl
: