Target
cAMP-dependent protein kinase catalytic subunit alpha
Ligand
BDBM50219803
Substrate
Meas. Tech.
ChEMBL_448968 (CHEMBL899231)
IC50
12.9±n/a nM
Citation
 Enkvist, ERaidaru, GVaasa, APehk, TLavogina, DUri, A Carbocyclic 3'-deoxyadenosine-based highly potent bisubstrate-analog inhibitor of basophilic protein kinases. Bioorg Med Chem Lett 17:5336-9 (2007)  
Target
Name:
cAMP-dependent protein kinase catalytic subunit alpha
Synonyms:
KAPCA_HUMAN PKACA cAMP-dependent protein kinase (PKA) cAMP-dependent protein kinase catalytic subunit alpha cAMP-dependent protein kinase catalytic subunit alpha (PKACA) cAMP-dependent protein kinase catalytic subunit alpha isoform 1 | cAMP-dependent protein kinase, alpha-catalytic subunit
Type:
Enzyme Catalytic Subunit
Mol. Mass.:
40598.73
Organism:
Homo sapiens (Human)
Description:
Residue:
351
  
Inhibitor
Name:
BDBM50219803
Synonyms:
6-{[(1S,3R,4R)-3-(6-amino-9H-purin-9-yl)-4-hydroxycyclopentyl]formamido}-N-[(1S)-4-carbamimidamido-1-{[(1S)-4-carbamimidamido-1-{[(1S)-4-carbamimidamido-1-{[(1S)-4-carbamimidamido-1-{[(1S)-4-carbamimidamido-1-{[(1S)-4-carbamimidamido-1-carbamoylbutyl]carbamoyl}butyl]carbamoyl}butyl]carbamoyl}butyl]carbamoyl}butyl]carbamoyl}butyl]hexanamide | CHEMBL397521
Type:
Small organic molecule
Emp. Form.:
C53H97N31O9
Mol. Mass.:
1312.5396
SMILES:
[#7]\[#6](-[#7])=[#7]\[#6]-[#6]-[#6]-[#6@H](-[#7]-[#6](=O)-[#6@H](-[#6]-[#6]-[#6]\[#7]=[#6](/[#7])-[#7])-[#7]-[#6](=O)-[#6@H](-[#6]-[#6]-[#6]\[#7]=[#6](/[#7])-[#7])-[#7]-[#6](=O)-[#6@H](-[#6]-[#6]-[#6]\[#7]=[#6](/[#7])-[#7])-[#7]-[#6](=O)-[#6@H](-[#6]-[#6]-[#6]\[#7]=[#6](/[#7])-[#7])-[#7]-[#6](=O)-[#6@H](-[#6]-[#6]-[#6]\[#7]=[#6](/[#7])-[#7])-[#7]-[#6](=O)-[#6]-[#6]-[#6]-[#6]-[#6]-[#7]-[#6](=O)-[#6@@H]-1-[#6]-[#6@@H](-[#8])-[#6@@H](-[#6]-1)-n1cnc2c(-[#7])ncnc12)-[#6](-[#7])=O
: