Target
cAMP-dependent protein kinase catalytic subunit alpha
Ligand
BDBM50219804
Substrate
Meas. Tech.
ChEMBL_448967 (CHEMBL899230)
IC50
168000±n/a nM
Citation
 Enkvist, ERaidaru, GVaasa, APehk, TLavogina, DUri, A Carbocyclic 3'-deoxyadenosine-based highly potent bisubstrate-analog inhibitor of basophilic protein kinases. Bioorg Med Chem Lett 17:5336-9 (2007)  
Target
Name:
cAMP-dependent protein kinase catalytic subunit alpha
Synonyms:
KAPCA_HUMAN PKACA cAMP-dependent protein kinase (PKA) cAMP-dependent protein kinase catalytic subunit alpha cAMP-dependent protein kinase catalytic subunit alpha (PKACA) cAMP-dependent protein kinase catalytic subunit alpha isoform 1 | cAMP-dependent protein kinase, alpha-catalytic subunit
Type:
Enzyme Catalytic Subunit
Mol. Mass.:
40598.73
Organism:
Homo sapiens (Human)
Description:
Residue:
351
  
Inhibitor
Name:
BDBM50219804
Synonyms:
(1S,3R,4R)-methyl 3-(6-amino-9H-purin-9-yl)-4-hydroxycyclopentanecarboxylate | CHEMBL235074
Type:
Small organic molecule
Emp. Form.:
C12H15N5O3
Mol. Mass.:
277.2792
SMILES:
COC(=O)[C@@H]1C[C@@H](O)[C@@H](C1)n1cnc2c(N)ncnc12
: