Target
D(3) dopamine receptor
Ligand
BDBM50219948
Substrate
Meas. Tech.
ChEMBL_449063 (CHEMBL898268)
IC50
2.6±n/a nM
Citation
 Agai-Csongor, ENógrádi, KGalambos, JVágó, IBielik, AMagdó, IIgnácz-Szendrei, GKeseru, GMGreiner, ILaszlovszky, ISchmidt, EKiss, BSághy, KLaszy, JGyertyán, IZájer-Balázs, MGémesi, LDomány, G Novel sulfonamides having dual dopamine D2 and D3 receptor affinity show in vivo antipsychotic efficacy with beneficial cognitive and EPS profile. Bioorg Med Chem Lett 17:5340-4 (2007)  
Target
Name:
D(3) dopamine receptor
Synonyms:
DOPAMINE D3 Dopamine D3 receptor | Drd3
Type:
Protein
Mol. Mass.:
49540.58
Organism:
Rattus norvegicus (Rat)
Description:
P19020
Residue:
446
  
Inhibitor
Name:
BDBM50219948
Synonyms:
CHEMBL236407 | N-((1r,4r)-4-(2-(4-(3-(trifluoromethyl)benzyl)piperidin-1-yl)ethyl)cyclohexyl)benzo[b]thiophene-2-sulfonamide
Type:
Small organic molecule
Emp. Form.:
C29H35F3N2O2S2
Mol. Mass.:
564.726
SMILES:
FC(F)(F)c1cccc(CC2CCN(CC[C@H]3CC[C@@H](CC3)NS(=O)(=O)c3cc4ccccc4s3)CC2)c1
: