Target
D(3) dopamine receptor
Ligand
BDBM50219936
Substrate
Meas. Tech.
ChEMBL_449063 (CHEMBL898268)
IC50
3.3±n/a nM
Citation
 Agai-Csongor, ENógrádi, KGalambos, JVágó, IBielik, AMagdó, IIgnácz-Szendrei, GKeseru, GMGreiner, ILaszlovszky, ISchmidt, EKiss, BSághy, KLaszy, JGyertyán, IZájer-Balázs, MGémesi, LDomány, G Novel sulfonamides having dual dopamine D2 and D3 receptor affinity show in vivo antipsychotic efficacy with beneficial cognitive and EPS profile. Bioorg Med Chem Lett 17:5340-4 (2007)  
Target
Name:
D(3) dopamine receptor
Synonyms:
DOPAMINE D3 Dopamine D3 receptor | Drd3
Type:
Protein
Mol. Mass.:
49540.58
Organism:
Rattus norvegicus (Rat)
Description:
P19020
Residue:
446
  
Inhibitor
Name:
BDBM50219936
Synonyms:
4-bromo-N-((1r,4r)-4-(2-(4-(3-cyano-5-(trifluoromethyl)phenyl)piperazin-1-yl)ethyl)cyclohexyl)benzenesulfonamide | CHEMBL239846
Type:
Small organic molecule
Emp. Form.:
C26H30BrF3N4O2S
Mol. Mass.:
599.506
SMILES:
FC(F)(F)c1cc(cc(c1)N1CCN(CC[C@H]2CC[C@@H](CC2)NS(=O)(=O)c2ccc(Br)cc2)CC1)C#N
: