Target
D(3) dopamine receptor
Ligand
BDBM50219941
Substrate
Meas. Tech.
ChEMBL_449063 (CHEMBL898268)
IC50
4.2±n/a nM
Citation
 Agai-Csongor, ENógrádi, KGalambos, JVágó, IBielik, AMagdó, IIgnácz-Szendrei, GKeseru, GMGreiner, ILaszlovszky, ISchmidt, EKiss, BSághy, KLaszy, JGyertyán, IZájer-Balázs, MGémesi, LDomány, G Novel sulfonamides having dual dopamine D2 and D3 receptor affinity show in vivo antipsychotic efficacy with beneficial cognitive and EPS profile. Bioorg Med Chem Lett 17:5340-4 (2007)  
Target
Name:
D(3) dopamine receptor
Synonyms:
DOPAMINE D3 Dopamine D3 receptor | Drd3
Type:
Protein
Mol. Mass.:
49540.58
Organism:
Rattus norvegicus (Rat)
Description:
P19020
Residue:
446
  
Inhibitor
Name:
BDBM50219941
Synonyms:
CHEMBL240909 | N-((1r,4r)-4-(2-(4-(3-cyano-5-(trifluoromethyl)phenyl)piperazin-1-yl)ethyl)cyclohexyl)-6-methylpyridine-3-sulfonamide
Type:
Small organic molecule
Emp. Form.:
C26H32F3N5O2S
Mol. Mass.:
535.625
SMILES:
Cc1ccc(cn1)S(=O)(=O)N[C@H]1CC[C@H](CCN2CCN(CC2)c2cc(cc(c2)C(F)(F)F)C#N)CC1
: