Target
Kinesin-like protein KIF11
Ligand
BDBM50220324
Substrate
Meas. Tech.
ChEMBL_449205 (CHEMBL898408)
IC50
0.82±n/a nM
Citation
 Coleman, PJSchreier, JDCox, CDFraley, MEGarbaccio, RMBuser, CAWalsh, ESHamilton, KLobell, RBRickert, KTao, WDiehl, RESouth, VJDavide, JPKohl, NEYan, YKuo, LPrueksaritanont, TLi, CMahan, EAFernandez-Metzler, CSalata, JJHartman, GD Kinesin spindle protein (KSP) inhibitors. Part 6: Design and synthesis of 3,5-diaryl-4,5-dihydropyrazole amides as potent inhibitors of the mitotic kinesin KSP. Bioorg Med Chem Lett 17:5390-5 (2007)  
Target
Name:
Kinesin-like protein KIF11
Synonyms:
EG5 KIF11_HUMAN Kinesin Spindle Protein Eg5 TRIP5 | kinesin spindle protein
Type:
PROTEIN
Mol. Mass.:
119138.97
Organism:
Homo sapiens (Human)
Description:
ChEMBL_1457426
Residue:
1056
  
Inhibitor
Name:
BDBM50220324
Synonyms:
1-((R)-5-((S)-3-amino-2-fluoropropyl)-3-(2,5-difluorophenyl)-5-phenyl-4,5-dihydropyrazol-1-yl)ethanone | CHEMBL400042
Type:
Small organic molecule
Emp. Form.:
C20H20F3N3O
Mol. Mass.:
375.3875
SMILES:
CC(=O)N1N=C(C[C@@]1(C[C@H](F)CN)c1ccccc1)c1cc(F)ccc1F
: