Target
D(1A) dopamine receptor
Ligand
BDBM50220541
Substrate
Meas. Tech.
ChEMBL_457315 (CHEMBL941848)
Ki
18000±n/a nM
Citation
 Stark, DPiel, MHübner, HGmeiner, PGründer, GRösch, F In vitro affinities of various halogenated benzamide derivatives as potential radioligands for non-invasive quantification of D(2)-like dopamine receptors. Bioorg Med Chem 15:6819-29 (2007)  
Target
Name:
D(1A) dopamine receptor
Synonyms:
DRD1 Dopamine D1 receptor
Type:
PROTEIN
Mol. Mass.:
49269.92
Organism:
Sus scrofa
Description:
ChEMBL_1460140
Residue:
446
  
Inhibitor
Name:
BDBM50220541
Synonyms:
CHEMBL392158 N-(((S)-1-allylpyrrolidin-2-yl)methyl)-5-(3-fluoropropyl)-2,3-dimethoxybenzamide
Type:
Small organic molecule
Emp. Form.:
C20H29FN2O3
Mol. Mass.:
364.4543
SMILES:
COc1cc(CCCF)cc(C(=O)NC[C@@H]2CCCN2CC=C)c1OC
: