Target
D(3) dopamine receptor
Ligand
BDBM50007517
Substrate
Meas. Tech.
ChEMBL_457318 (CHEMBL941851)
Ki
0.42±n/a nM
Citation
 Stark, DPiel, MHübner, HGmeiner, PGründer, GRösch, F In vitro affinities of various halogenated benzamide derivatives as potential radioligands for non-invasive quantification of D(2)-like dopamine receptors. Bioorg Med Chem 15:6819-29 (2007)  
Target
Name:
D(3) dopamine receptor
Synonyms:
DOPAMINE D3 DRD3_HUMAN Dopamine D3 receptor (D3) Dopamine receptor Dopamine receptor D3
Type:
Mol. Mass.:
44243.43
Organism:
Homo sapiens (Human)
Description:
Residue:
400
  
Inhibitor
Name:
BDBM50007517
Synonyms:
(S)-3-bromo-N-((1-ethylpyrrolidin-2-yl)methyl)-2-hydroxy-5,6-dimethoxybenzamide CHEMBL76402
Type:
Small organic molecule
Emp. Form.:
C16H23BrN2O4
Mol. Mass.:
387.269
SMILES:
CCN1CCC[C@H]1CNC(=O)c1c(O)c(Br)cc(OC)c1OC
: