Target
D(3) dopamine receptor
Ligand
BDBM50220546
Substrate
Meas. Tech.
ChEMBL_457318 (CHEMBL941851)
Ki
11±n/a nM
Citation
 Stark, DPiel, MHübner, HGmeiner, PGründer, GRösch, F In vitro affinities of various halogenated benzamide derivatives as potential radioligands for non-invasive quantification of D(2)-like dopamine receptors. Bioorg Med Chem 15:6819-29 (2007)  
Target
Name:
D(3) dopamine receptor
Synonyms:
DOPAMINE D3 DRD3_HUMAN Dopamine D3 receptor (D3) Dopamine receptor Dopamine receptor D3
Type:
Mol. Mass.:
44243.43
Organism:
Homo sapiens (Human)
Description:
Residue:
400
  
Inhibitor
Name:
BDBM50220546
Synonyms:
CHEMBL397103 | N-(((S)-1-allylpyrrolidin-2-yl)methyl)-5-iodo-2-methoxybenzamide
Type:
Small organic molecule
Emp. Form.:
C16H21IN2O2
Mol. Mass.:
400.2546
SMILES:
COc1ccc(I)cc1C(=O)NC[C@@H]1CCCN1CC=C
: