Target
D(2) dopamine receptor
Ligand
BDBM50220545
Substrate
Meas. Tech.
ChEMBL_457316 (CHEMBL941849)
Ki
27±n/a nM
Citation
 Stark, DPiel, MHübner, HGmeiner, PGründer, GRösch, F In vitro affinities of various halogenated benzamide derivatives as potential radioligands for non-invasive quantification of D(2)-like dopamine receptors. Bioorg Med Chem 15:6819-29 (2007)  
Target
Name:
D(2) dopamine receptor
Synonyms:
D(2) dopamine receptor DOPAMINE D2 Long DRD2 Dopamine D2 receptor Dopamine D2 receptor (D2R) Dopamine2-like | d2
Type:
Cell-surface receptors
Mol. Mass.:
50647.10
Organism:
Homo sapiens (Human)
Description:
P14416
Residue:
443
  
Inhibitor
Name:
BDBM50220545
Synonyms:
CHEMBL397592 | N-(((S)-1-allylpyrrolidin-2-yl)methyl)-5-bromo-2-methoxybenzamide
Type:
Small organic molecule
Emp. Form.:
C16H21BrN2O2
Mol. Mass.:
353.254
SMILES:
COc1ccc(Br)cc1C(=O)NC[C@@H]1CCCN1CC=C
: