Target
Poly [ADP-ribose] polymerase 1
Ligand
BDBM50220858
Substrate
Meas. Tech.
ChEMBL_457431 (CHEMBL941003)
IC50
8.7±n/a nM
Citation
 Hattori, KKido, YYamamoto, HIshida, JIwashita, AMihara, K Rational design of conformationally restricted quinazolinone inhibitors of poly(ADP-ribose)polymerase. Bioorg Med Chem Lett 17:5577-81 (2007)  
Target
Name:
Poly [ADP-ribose] polymerase 1
Synonyms:
(ARTD1 or PARP1) 2.4.2.30 ADPRT ARTD1 Human diphtheria toxin-like ADP-ribosyltransferase (ARTD1 or PARP1) NT-PARP-1 PARP1 PPOL Poly [ADP-ribose] polymerase 1 (PARP) Poly [ADP-ribose] polymerase 1 (PARP1) Poly [ADP-ribose] polymerase 1, 28-kDa form Poly [ADP-ribose] polymerase 1, processed C-terminus Poly [ADP-ribose] polymerase-1 Poly(ADP-ribose) polymerase-1 (ARTD1/PARP1) Protein poly-ADP-ribosyltransferase PARP1 | Synonyms=ADPRT
Type:
Mol. Mass.:
113114.22
Organism:
Homo sapiens (Human)
Description:
P09874
Residue:
1014
  
Inhibitor
Name:
BDBM50220858
Synonyms:
(S)-8-chloro-2-(3-(4-phenylpiperidin-1-yl)cyclopent-1-enyl)quinazolin-4(3H)-one CHEMBL248648
Type:
Small organic molecule
Emp. Form.:
C24H24ClN3O
Mol. Mass.:
405.92
SMILES:
Clc1cccc2c1nc([nH]c2=O)C1=C[C@H](CC1)N1CCC(CC1)c1ccccc1
: