Target
Poly [ADP-ribose] polymerase 1
Ligand
BDBM50220862
Substrate
Meas. Tech.
ChEMBL_457431 (CHEMBL941003)
IC50
16±n/a nM
Citation
 Hattori, KKido, YYamamoto, HIshida, JIwashita, AMihara, K Rational design of conformationally restricted quinazolinone inhibitors of poly(ADP-ribose)polymerase. Bioorg Med Chem Lett 17:5577-81 (2007)  
Target
Name:
Poly [ADP-ribose] polymerase 1
Synonyms:
(ARTD1 or PARP1) 2.4.2.30 ADPRT ARTD1 Human diphtheria toxin-like ADP-ribosyltransferase (ARTD1 or PARP1) NT-PARP-1 PARP1 PPOL Poly [ADP-ribose] polymerase 1 (PARP) Poly [ADP-ribose] polymerase 1 (PARP1) Poly [ADP-ribose] polymerase 1, 28-kDa form Poly [ADP-ribose] polymerase 1, processed C-terminus Poly [ADP-ribose] polymerase-1 Poly(ADP-ribose) polymerase-1 (ARTD1/PARP1) Protein poly-ADP-ribosyltransferase PARP1 | Synonyms=ADPRT
Type:
Mol. Mass.:
113114.22
Organism:
Homo sapiens (Human)
Description:
P09874
Residue:
1014
  
Inhibitor
Name:
BDBM50220862
Synonyms:
2-(3-(4-phenyl-5,6-dihydropyridin-1(2H)-yl)cyclopent-1-enyl)quinazolin-4(3H)-one | CHEMBL250013
Type:
Small organic molecule
Emp. Form.:
C24H23N3O
Mol. Mass.:
369.4589
SMILES:
O=c1[nH]c(nc2ccccc12)C1=CC(CC1)N1CCC(=CC1)c1ccccc1
: