Target
Poly [ADP-ribose] polymerase 1
Ligand
BDBM50220882
Substrate
Meas. Tech.
ChEMBL_457431 (CHEMBL941003)
IC50
18±n/a nM
Citation
 Hattori, KKido, YYamamoto, HIshida, JIwashita, AMihara, K Rational design of conformationally restricted quinazolinone inhibitors of poly(ADP-ribose)polymerase. Bioorg Med Chem Lett 17:5577-81 (2007)  
Target
Name:
Poly [ADP-ribose] polymerase 1
Synonyms:
(ARTD1 or PARP1) 2.4.2.30 ADPRT ARTD1 Human diphtheria toxin-like ADP-ribosyltransferase (ARTD1 or PARP1) NT-PARP-1 PARP1 PPOL Poly [ADP-ribose] polymerase 1 (PARP) Poly [ADP-ribose] polymerase 1 (PARP1) Poly [ADP-ribose] polymerase 1, 28-kDa form Poly [ADP-ribose] polymerase 1, processed C-terminus Poly [ADP-ribose] polymerase-1 Poly(ADP-ribose) polymerase-1 (ARTD1/PARP1) Protein poly-ADP-ribosyltransferase PARP1 | Synonyms=ADPRT
Type:
Mol. Mass.:
113114.22
Organism:
Homo sapiens (Human)
Description:
P09874
Residue:
1014
  
Inhibitor
Name:
BDBM50220882
Synonyms:
2-(3-(4-(4-fluorophenyl)-5,6-dihydropyridin-1(2H)-yl)cyclopent-1-enyl)quinazolin-4(3H)-one | CHEMBL248826
Type:
Small organic molecule
Emp. Form.:
C24H22FN3O
Mol. Mass.:
387.4494
SMILES:
Fc1ccc(cc1)C1=CCN(CC1)C1CCC(=C1)c1nc2ccccc2c(=O)[nH]1
: