Target
Poly [ADP-ribose] polymerase 1
Ligand
BDBM50220883
Substrate
Meas. Tech.
ChEMBL_457431 (CHEMBL941003)
IC50
25±n/a nM
Citation
 Hattori, KKido, YYamamoto, HIshida, JIwashita, AMihara, K Rational design of conformationally restricted quinazolinone inhibitors of poly(ADP-ribose)polymerase. Bioorg Med Chem Lett 17:5577-81 (2007)  
Target
Name:
Poly [ADP-ribose] polymerase 1
Synonyms:
(ARTD1 or PARP1) 2.4.2.30 ADPRT ARTD1 Human diphtheria toxin-like ADP-ribosyltransferase (ARTD1 or PARP1) NT-PARP-1 PARP1 PPOL Poly [ADP-ribose] polymerase 1 (PARP) Poly [ADP-ribose] polymerase 1 (PARP1) Poly [ADP-ribose] polymerase 1, 28-kDa form Poly [ADP-ribose] polymerase 1, processed C-terminus Poly [ADP-ribose] polymerase-1 Poly(ADP-ribose) polymerase-1 (ARTD1/PARP1) Protein poly-ADP-ribosyltransferase PARP1 | Synonyms=ADPRT
Type:
Mol. Mass.:
113114.22
Organism:
Homo sapiens (Human)
Description:
P09874
Residue:
1014
  
Inhibitor
Name:
BDBM50220883
Synonyms:
8-chloro-2-(3-(4-(4-fluorophenyl)piperazin-1-yl)cyclopent-1-enyl)quinazolin-4(3H)-one | CHEMBL400344
Type:
Small organic molecule
Emp. Form.:
C23H22ClFN4O
Mol. Mass.:
424.898
SMILES:
Fc1ccc(cc1)N1CCN(CC1)C1CCC(=C1)c1nc2c(Cl)cccc2c(=O)[nH]1
: