Target
Dipeptidyl peptidase 8
Ligand
BDBM50221443
Substrate
Meas. Tech.
ChEMBL_457607 (CHEMBL923808)
IC50
>100000±n/a nM
Citation
 Kowalchick, JELeiting, BPryor, KDMarsilio, FWu, JKHe, HLyons, KAEiermann, GJPetrov, AScapin, GPatel, RAThornberry, NAWeber, AEKim, D Design, synthesis, and biological evaluation of triazolopiperazine-based beta-amino amides as potent, orally active dipeptidyl peptidase IV (DPP-4) inhibitors. Bioorg Med Chem Lett 17:5934-9 (2007)  
Target
Name:
Dipeptidyl peptidase 8
Synonyms:
DPP8 DPRP-1 Dipeptidyl peptidase 8 (DPP-8) Dipeptidyl peptidase 8/9 Dipeptidyl peptidase VIII Prolyl dipeptidase DPP8
Type:
Enzyme
Mol. Mass.:
103342.62
Organism:
Homo sapiens (Human)
Description:
Q6V1X1
Residue:
898
  
Inhibitor
Name:
BDBM50221443
Synonyms:
(2R)-4-[(8R)-8-METHYL-2-(TRIFLUOROMETHYL)-5,6-DIHYDRO[1,2,4]TRIAZOLO[1,5-A]PYRAZIN-7(8H)-YL]-4-OXO-1-(2,4,5-TRIFLUOROPHENYL)BUTAN-2-AMINE CHEMBL250787
Type:
Small organic molecule
Emp. Form.:
C17H17F6N5O
Mol. Mass.:
421.3402
SMILES:
C[C@H]1N(CCn2nc(nc12)C(F)(F)F)C(=O)C[C@H](N)Cc1cc(F)c(F)cc1F
: