Target
Cannabinoid receptor 1
Ligand
BDBM50221708
Substrate
Meas. Tech.
ChEMBL_457679 (CHEMBL923956)
Ki
194.85±n/a nM
Citation
 Bourne, CRoy, SWiley, JLMartin, BRThomas, BFMahadevan, ARazdan, RK Novel, potent THC/anandamide (hybrid) analogs. Bioorg Med Chem 15:7850-64 (2007)  
Target
Name:
Cannabinoid receptor 1
Synonyms:
CANN6 CB-R CNR CNR1_HUMAN Cannabinoid receptor Cannabinoid receptor 1 (brain)
Type:
G Protein-Coupled Receptor (GPCR)
Mol. Mass.:
52868.96
Organism:
Homo sapiens (Human)
Description:
P21554
Residue:
472
  
Inhibitor
Name:
BDBM50221708
Synonyms:
11-[4-(1,1-dimethylheptyl)phenoxy]undeca-5,8-dienoic acid [R(1-hydroxypropan-2-yl)]-amide | CHEMBL240100
Type:
Small organic molecule
Emp. Form.:
C29H47NO3
Mol. Mass.:
457.6884
SMILES:
CCCCCCC(C)(C)c1ccc(OCC\C=C/C\C=C/CCCC(=O)N[C@H](C)CO)cc1
: