Target
Mu-type opioid receptor
Ligand
BDBM50221985
Substrate
Meas. Tech.
ChEMBL_449780 (CHEMBL897836)
IC50
285.6±n/a nM
Citation
 Salvadori, STrapella, CFiorini, SNegri, LLattanzi, RBryant, SDJinsmaa, YLazarus, LHBalboni, G A new opioid designed multiple ligand derived from the micro opioid agonist endomorphin-2 and the delta opioid antagonist pharmacophore Dmt-Tic. Bioorg Med Chem 15:6876-81 (2007)  
Target
Name:
Mu-type opioid receptor
Synonyms:
M-OR-1 Mu opioid receptor OPIATE Mu OPRM_CAVPO
Type:
Enzyme Catalytic Domain
Mol. Mass.:
11165.58
Organism:
GUINEA PIG
Description:
P97266
Residue:
98
  
Inhibitor
Name:
BDBM50221985
Synonyms:
CHEMBL241010 | H-Dmt-Tic-NH-CH2-CH2-NH2
Type:
Small organic molecule
Emp. Form.:
C23H30N4O3
Mol. Mass.:
410.5093
SMILES:
Cc1cc(O)cc(C)c1C[C@H](N)C(=O)N1Cc2ccccc2CC1C(=O)NCCN
: