Target
Delta-type opioid receptor
Ligand
BDBM50221986
Substrate
Meas. Tech.
ChEMBL_449775 (CHEMBL898880)
Ki
1.45±n/a nM
Citation
 Salvadori, STrapella, CFiorini, SNegri, LLattanzi, RBryant, SDJinsmaa, YLazarus, LHBalboni, G A new opioid designed multiple ligand derived from the micro opioid agonist endomorphin-2 and the delta opioid antagonist pharmacophore Dmt-Tic. Bioorg Med Chem 15:6876-81 (2007)  
Target
Name:
Delta-type opioid receptor
Synonyms:
Cytochrome P450 3A4 Delta opioid receptor Delta-type opioid receptor (DOR) OPRD_RAT Opioid receptor Opioid receptors; mu & delta Ror-a | Voltage-gated potassium channel
Type:
G Protein-Coupled Receptor (GPCR)
Mol. Mass.:
40465.04
Organism:
Rattus norvegicus (rat)
Description:
Competition binding assays were using CHO-K1 cell membranes expressing the opioid receptor.
Residue:
372
  
Inhibitor
Name:
BDBM50221986
Synonyms:
CHEMBL392469 | H-Tyr-Pro-Phe-Phe-NH-CH2-CH2-NH Tic Dmt-H
Type:
Small organic molecule
Emp. Form.:
C55H64N8O8
Mol. Mass.:
965.1455
SMILES:
Cc1cc(O)cc(C)c1C[C@H](N)C(=O)N1Cc2ccccc2CC1C(=O)NCCNC(=O)[C@H](Cc1ccccc1)NC(=O)[C@H](Cc1ccccc1)NC(=O)[C@@H]1CCCN1C(=O)[C@@H](N)Cc1ccc(O)cc1
: