Target
Cannabinoid receptor 1
Ligand
BDBM50292328
Substrate
Meas. Tech.
ChEMBL_457977 (CHEMBL924246)
EC50
11900±n/a nM
Citation
 Cano, CGoya, PPaez, JAGirón, RSánchez, EMartín, MI Discovery of 1,1-dioxo-1,2,6-thiadiazine-5-carboxamide derivatives as cannabinoid-like molecules with agonist and antagonist activity. Bioorg Med Chem 15:7480-93 (2007)  
Target
Name:
Cannabinoid receptor 1
Synonyms:
Brain-type cannabinoid receptor CB-R CNR1_MOUSE Cannabinoid receptor | Cnr1
Type:
Enzyme
Mol. Mass.:
52842.52
Organism:
Mus musculus (Mouse)
Description:
P47746
Residue:
473
  
Inhibitor
Name:
BDBM50292328
Synonyms:
CHEMBL241567 | N-(1,3,3-trimethylbicyclo[2.2.1]hept-2-yl)-2-benzyl-3-(4-chlorophenyl)-1,1-dioxo-1,2-dihydro-1lambda6-1,2,6-thiadiazine-5-carboxamide
Type:
Small organic molecule
Emp. Form.:
C27H30ClN3O3S
Mol. Mass.:
512.063
SMILES:
CC1(C)C2CCC(C)(C2)C1NC(=O)C1=NS(=O)(=O)N(Cc2ccccc2)C(=C1)c1ccc(Cl)cc1
: