Target
Corticotropin-releasing factor receptor 1
Ligand
BDBM50223025
Substrate
Meas. Tech.
ChEMBL_458068 (CHEMBL925405)
Ki
1208±n/a nM
Citation
 Corbett, JWRauckhorst, MRQian, FHoffman, RLKnauer, CSFitzgerald, LW Heteroatom-linked indanylpyrazines are corticotropin releasing factor type-1 receptor antagonists. Bioorg Med Chem Lett 17:6250-6 (2007)  
Target
Name:
Corticotropin-releasing factor receptor 1
Synonyms:
CRF-R CRF1 CRFR1 CRH-R 1 CRHR1 Corticotropin-releasing factor receptor 1 (CRF-1) Corticotropin-releasing hormone receptor 1
Type:
Enzyme
Mol. Mass.:
50744.31
Organism:
Homo sapiens (Human)
Description:
P34998
Residue:
444
  
Inhibitor
Name:
BDBM50223025
Synonyms:
CHEMBL249212 | N2-(3,5-dichloropyridin-2-yl)-3,6-diethyl-N5-((1R,2S)-2-(2-fluoroethoxy)-2,3-dihydro-1H-inden-1-yl)-N2-methylpyrazine-2,5-diamine
Type:
Small organic molecule
Emp. Form.:
C25H28Cl2FN5O
Mol. Mass.:
504.427
SMILES:
CCc1nc(N(C)c2ncc(Cl)cc2Cl)c(CC)nc1N[C@H]1[C@H](Cc2ccccc12)OCCF
: