Target
Epidermal growth factor receptor
Ligand
BDBM50223082
Substrate
Meas. Tech.
ChEMBL_458089 (CHEMBL924351)
IC50
89±n/a nM
Citation
 Liu, LTYuan, TTLiu, HHChen, SFWu, YT Synthesis and biological evaluation of substituted 6-alkynyl-4-anilinoquinazoline derivatives as potent EGFR inhibitors. Bioorg Med Chem Lett 17:6373-7 (2007)  
Target
Name:
Epidermal growth factor receptor
Synonyms:
EGF Receptor Substrate EGFR_HUMAN ERBB1 Epidermal Growth Factor Receptor erbB-1 Epidermal growth factor receptor (EGFR) HER1 Proto-oncogene c-ErbB-1 Tyrosine-Protein Kinase ErbB-1
Type:
Receptor Kinase Domain
Mol. Mass.:
134279.59
Organism:
Homo sapiens (Human)
Description:
P00533
Residue:
1210
  
Inhibitor
Name:
BDBM50223082
Synonyms:
CHEMBL251700 | N-(3-chloro-4-fluorophenyl)-6-(3-(piperidin-1-yl)prop-1-ynyl)quinazolin-4-amine
Type:
Small organic molecule
Emp. Form.:
C22H20ClFN4
Mol. Mass.:
394.872
SMILES:
Fc1ccc(Nc2ncnc3ccc(cc23)C#CCN2CCCCC2)cc1Cl
: