Target
Epidermal growth factor receptor
Ligand
BDBM50223091
Substrate
Meas. Tech.
ChEMBL_458089 (CHEMBL924351)
IC50
402±n/a nM
Citation
 Liu, LTYuan, TTLiu, HHChen, SFWu, YT Synthesis and biological evaluation of substituted 6-alkynyl-4-anilinoquinazoline derivatives as potent EGFR inhibitors. Bioorg Med Chem Lett 17:6373-7 (2007)  
Target
Name:
Epidermal growth factor receptor
Synonyms:
EGF Receptor Substrate EGFR_HUMAN ERBB1 Epidermal Growth Factor Receptor erbB-1 Epidermal growth factor receptor (EGFR) HER1 Proto-oncogene c-ErbB-1 Tyrosine-Protein Kinase ErbB-1
Type:
Receptor Kinase Domain
Mol. Mass.:
134279.59
Organism:
Homo sapiens (Human)
Description:
P00533
Residue:
1210
  
Inhibitor
Name:
BDBM50223091
Synonyms:
4-(3-(6,7-dimethoxyquinazolin-4-ylamino)phenyl)but-3-yn-1-ol | CHEMBL248674
Type:
Small organic molecule
Emp. Form.:
C20H19N3O3
Mol. Mass.:
349.3832
SMILES:
COc1cc2ncnc(Nc3cccc(c3)C#CCCO)c2cc1OC
: