Target
Epidermal growth factor receptor
Ligand
BDBM50223092
Substrate
Meas. Tech.
ChEMBL_458089 (CHEMBL924351)
IC50
114±n/a nM
Citation
 Liu, LTYuan, TTLiu, HHChen, SFWu, YT Synthesis and biological evaluation of substituted 6-alkynyl-4-anilinoquinazoline derivatives as potent EGFR inhibitors. Bioorg Med Chem Lett 17:6373-7 (2007)  
Target
Name:
Epidermal growth factor receptor
Synonyms:
EGF Receptor Substrate EGFR_HUMAN ERBB1 Epidermal Growth Factor Receptor erbB-1 Epidermal growth factor receptor (EGFR) HER1 Proto-oncogene c-ErbB-1 Tyrosine-Protein Kinase ErbB-1
Type:
Receptor Kinase Domain
Mol. Mass.:
134279.59
Organism:
Homo sapiens (Human)
Description:
P00533
Residue:
1210
  
Inhibitor
Name:
BDBM50223092
Synonyms:
5-(4-(3-chloro-4-fluorophenylamino)quinazolin-6-yl)pent-4-yn-1-ol | CHEMBL251291
Type:
Small organic molecule
Emp. Form.:
C19H15ClFN3O
Mol. Mass.:
355.793
SMILES:
OCCCC#Cc1ccc2ncnc(Nc3ccc(F)c(Cl)c3)c2c1
: