Target
Epidermal growth factor receptor
Ligand
BDBM50095259
Substrate
Meas. Tech.
ChEMBL_458089 (CHEMBL924351)
IC50
29±n/a nM
Citation
 Liu, LTYuan, TTLiu, HHChen, SFWu, YT Synthesis and biological evaluation of substituted 6-alkynyl-4-anilinoquinazoline derivatives as potent EGFR inhibitors. Bioorg Med Chem Lett 17:6373-7 (2007)  
Target
Name:
Epidermal growth factor receptor
Synonyms:
EGF Receptor Substrate EGFR_HUMAN ERBB1 Epidermal Growth Factor Receptor erbB-1 Epidermal growth factor receptor (EGFR) HER1 Proto-oncogene c-ErbB-1 Tyrosine-Protein Kinase ErbB-1
Type:
Receptor Kinase Domain
Mol. Mass.:
134279.59
Organism:
Homo sapiens (Human)
Description:
P00533
Residue:
1210
  
Inhibitor
Name:
BDBM50095259
Synonyms:
(6,7-Dimethoxy-quinazolin-4-yl)-(3-ethynyl-phenyl)-amine N-(3-ethynylphenyl)-6,7-dimethoxyquinazolin-4-amine
Type:
Small organic molecule
Emp. Form.:
C18H15N3O2
Mol. Mass.:
305.3306
SMILES:
COc1cc2ncnc(Nc3cccc(c3)C#C)c2cc1OC
: