Target
Urease
Ligand
BDBM50223157
Substrate
Meas. Tech.
ChEMBL_458108 (CHEMBL924370)
Ki
135±n/a nM
Citation
 Sivapriya, KSuguna, PBanerjee, ASaravanan, VRao, DNChandrasekaran, S Facile one-pot synthesis of thio and selenourea derivatives: a new class of potent urease inhibitors. Bioorg Med Chem Lett 17:6387-91 (2007)  
Target
Name:
Urease
Synonyms:
UREA_CANEN | Urea amidohydrolase
Type:
Enzyme
Mol. Mass.:
90746.20
Organism:
Canavalia ensiformis (Jack bean) (Horse bean)
Description:
P07374
Residue:
840
  
Inhibitor
Name:
BDBM50223157
Synonyms:
3-(4-bromobenzyl)-1,1-dimethylselenourea | CHEMBL398715
Type:
Small organic molecule
Emp. Form.:
C10H13BrN2Se
Mol. Mass.:
320.09
SMILES:
CN(C)C(=[Se])NCc1ccc(Br)cc1
: