Target
Urease
Ligand
BDBM50223159
Substrate
Meas. Tech.
ChEMBL_458108 (CHEMBL924370)
Ki
124±n/a nM
Citation
 Sivapriya, KSuguna, PBanerjee, ASaravanan, VRao, DNChandrasekaran, S Facile one-pot synthesis of thio and selenourea derivatives: a new class of potent urease inhibitors. Bioorg Med Chem Lett 17:6387-91 (2007)  
Target
Name:
Urease
Synonyms:
UREA_CANEN | Urea amidohydrolase
Type:
Enzyme
Mol. Mass.:
90746.20
Organism:
Canavalia ensiformis (Jack bean) (Horse bean)
Description:
P07374
Residue:
840
  
Inhibitor
Name:
BDBM50223159
Synonyms:
3-dodecyl-1,1-dimethylthiourea | CHEMBL251521
Type:
Small organic molecule
Emp. Form.:
C15H32N2S
Mol. Mass.:
272.493
SMILES:
CCCCCCCCCCCCNC(=S)N(C)C
: